Target
Gonadotropin-releasing hormone receptor
Ligand
BDBM50161500
Substrate
Meas. Tech.
ChEMBL_302818 (CHEMBL839508)
Ki
7600±n/a nM
Citation
 Tucci, FCZhu, YFStruthers, RSGuo, ZGross, TDRowbottom, MWAcevedo, OGao, YSaunders, JXie, QReinhart, GJLiu, XJLing, NBonneville, AKChen, TBozigian, HChen, C 3-[(2R)-Amino-2-phenylethyl]-1-(2,6-difluorobenzyl)-5-(2-fluoro-3-methoxyphenyl)- 6-methylpyrimidin-2,4-dione (NBI 42902) as a potent and orally active antagonist of the human gonadotropin-releasing hormone receptor. Design, synthesis, and in vitro and in vivo characterization. J Med Chem 48:1169-78 (2005)  
Target
Name:
Gonadotropin-releasing hormone receptor
Synonyms:
GNRHR_RAT GnRH-R | Gnrhr
Type:
PROTEIN
Mol. Mass.:
37767.60
Organism:
Rattus norvegicus
Description:
ChEMBL_1335047
Residue:
327
  
Inhibitor
Name:
BDBM50161500
Synonyms:
(R)-1-(2,6-difluorobenzyl)-3-(2-amino-2-phenylethyl)-5-(3-methoxyphenyl)-6-methylpyrimidine-2,4(1H,3H)-dione CHEMBL359894
Type:
Small organic molecule
Emp. Form.:
C27H25F2N3O3
Mol. Mass.:
477.5025
SMILES:
COc1cccc(c1)-c1c(C)n(Cc2c(F)cccc2F)c(=O)n(C[C@H](N)c2ccccc2)c1=O
: