Target
Gonadotropin-releasing hormone receptor
Ligand
BDBM50162034
Substrate
Meas. Tech.
ChEMBL_302845 (CHEMBL827890)
Ki
8.5±n/a nM
Citation
 Tucci, FCZhu, YFStruthers, RSGuo, ZGross, TDRowbottom, MWAcevedo, OGao, YSaunders, JXie, QReinhart, GJLiu, XJLing, NBonneville, AKChen, TBozigian, HChen, C 3-[(2R)-Amino-2-phenylethyl]-1-(2,6-difluorobenzyl)-5-(2-fluoro-3-methoxyphenyl)- 6-methylpyrimidin-2,4-dione (NBI 42902) as a potent and orally active antagonist of the human gonadotropin-releasing hormone receptor. Design, synthesis, and in vitro and in vivo characterization. J Med Chem 48:1169-78 (2005)  
Target
Name:
Gonadotropin-releasing hormone receptor
Synonyms:
GNRHR GRHR GnRH-R Gonadotropin-releasing hormone receptor | Gonadotropin-releasing hormone receptor (GnRH)
Type:
Enzyme
Mol. Mass.:
37749.45
Organism:
Homo sapiens (Human)
Description:
P30968
Residue:
328
  
Inhibitor
Name:
BDBM50162034
Synonyms:
3-((R)-2-Amino-2-phenyl-ethyl)-1-(2,6-difluoro-benzyl)-6-methyl-5-(4-phenoxy-phenyl)-1H-pyrimidine-2,4-dione | CHEMBL360935
Type:
Small organic molecule
Emp. Form.:
C32H27F2N3O3
Mol. Mass.:
539.5719
SMILES:
Cc1c(-c2ccc(Oc3ccccc3)cc2)c(=O)n(C[C@H](N)c2ccccc2)c(=O)n1Cc1c(F)cccc1F
: