Target
Gonadotropin-releasing hormone receptor
Ligand
BDBM50162008
Substrate
Meas. Tech.
ChEMBL_302845 (CHEMBL827890)
Ki
0.61±n/a nM
Citation
 Tucci, FCZhu, YFStruthers, RSGuo, ZGross, TDRowbottom, MWAcevedo, OGao, YSaunders, JXie, QReinhart, GJLiu, XJLing, NBonneville, AKChen, TBozigian, HChen, C 3-[(2R)-Amino-2-phenylethyl]-1-(2,6-difluorobenzyl)-5-(2-fluoro-3-methoxyphenyl)- 6-methylpyrimidin-2,4-dione (NBI 42902) as a potent and orally active antagonist of the human gonadotropin-releasing hormone receptor. Design, synthesis, and in vitro and in vivo characterization. J Med Chem 48:1169-78 (2005)  
Target
Name:
Gonadotropin-releasing hormone receptor
Synonyms:
GNRHR GRHR GnRH-R Gonadotropin-releasing hormone receptor | Gonadotropin-releasing hormone receptor (GnRH)
Type:
Enzyme
Mol. Mass.:
37749.45
Organism:
Homo sapiens (Human)
Description:
P30968
Residue:
328
  
Inhibitor
Name:
BDBM50162008
Synonyms:
(R)-1-(2-chloro-6-fluorobenzyl)-3-(2-amino-2-phenylethyl)-5-(2-fluorophenyl)-6-methylpyrimidine-2,4(1H,3H)-dione CHEMBL360143
Type:
Small organic molecule
Emp. Form.:
C26H22ClF2N3O2
Mol. Mass.:
481.922
SMILES:
Cc1c(-c2ccccc2F)c(=O)n(C[C@H](N)c2ccccc2)c(=O)n1Cc1c(F)cccc1Cl
: