Target
Platelet-derived growth factor receptor alpha
Ligand
BDBM50162152
Substrate
Meas. Tech.
ChEMBL_305182 (CHEMBL832771)
IC50
2±n/a nM
Citation
 Kubo, KShimizu, TOhyama, SMurooka, HIwai, ANakamura, KHasegawa, KKobayashi, YTakahashi, NTakahashi, KKato, SIzawa, TIsoe, T Novel potent orally active selective VEGFR-2 tyrosine kinase inhibitors: synthesis, structure-activity relationships, and antitumor activities of N-phenyl-N'-{4-(4-quinolyloxy)phenyl}ureas. J Med Chem 48:1359-66 (2005)  
Target
Name:
Platelet-derived growth factor receptor alpha
Synonyms:
Alpha-type platelet-derived growth factor receptor PDGFRA PGFRA_HUMAN Platelet-derived growth factor receptor alpha (PDGFRA) RHEPDGFRA
Type:
Protein
Mol. Mass.:
122633.38
Organism:
Homo sapiens (Human)
Description:
P16234
Residue:
1089
  
Inhibitor
Name:
BDBM50162152
Synonyms:
1-[4-(6,7-Dimethoxy-quinolin-4-yloxy)-phenyl]-3-(4-methoxy-phenyl)-urea | CHEMBL179593
Type:
Small organic molecule
Emp. Form.:
C25H23N3O5
Mol. Mass.:
445.4672
SMILES:
COc1ccc(NC(=O)Nc2ccc(Oc3ccnc4cc(OC)c(OC)cc34)cc2)cc1
: