Target
Dihydrofolate reductase
Ligand
BDBM50066490
Substrate
Meas. Tech.
ChEMBL_305729 (CHEMBL829401)
IC50
87.0±n/a nM
Citation
 Gangjee, ALin, X CoMFA and CoMSIA analyses of Pneumocystis carinii dihydrofolate reductase, Toxoplasma gondii dihydrofolate reductase, and rat liver dihydrofolate reductase. J Med Chem 48:1448-69 (2005)  
Target
Name:
Dihydrofolate reductase
Synonyms:
DYR_PNECA Dihydrofolate reductase Tetrahydrofolate dehydrogenase
Type:
Enzyme
Mol. Mass.:
23891.29
Organism:
Pneumocystis carinii
Description:
Residue:
206
  
Inhibitor
Name:
BDBM50066490
Synonyms:
2,4-DIAMINO-6-[N-(2',5'-DIMETHOXYBENZYL)-N-METHYLAMINO]QUINAZOLINE N*6*-(2,5-Dimethoxy-benzyl)-N*6*-methyl-quinazoline-2,4,6-triamine | N6-(2,5-dimethoxybenzyl)-N6-methylquinazoline-2,4,6-triamine
Type:
Small organic molecule
Emp. Form.:
C18H21N5O2
Mol. Mass.:
339.3916
SMILES:
COc1ccc(OC)c(CN(C)c2ccc3nc(N)nc(N)c3c2)c1
: