Target
C-C chemokine receptor type 3
Ligand
BDBM50162401
Substrate
Meas. Tech.
ChEMBL_303563 (CHEMBL828963)
Ki
1040±n/a nM
Citation
 Vedani, ADobler, MDollinger, HHasselbach, KMBirke, FLill, MA Novel ligands for the chemokine receptor-3 (CCR3): a receptor-modeling study based on 5D-QSAR. J Med Chem 48:1515-27 (2005)  
Target
Name:
C-C chemokine receptor type 3
Synonyms:
C-C CKR-3 CC-CKR-3 CCR3 CD_antigen=CD193 CMKBR3 | Eosinophil eotaxin receptor
Type:
Enzyme
Mol. Mass.:
41053.88
Organism:
Homo sapiens (Human)
Description:
P51677
Residue:
355
  
Inhibitor
Name:
BDBM50162401
Synonyms:
CHEMBL372496 | [2-(4-Cyclohexyl-piperazin-1-yl)-2-(4-methoxy-phenyl)-ethyl]-phenethyl-amine
Type:
Small organic molecule
Emp. Form.:
C27H39N3O
Mol. Mass.:
421.6181
SMILES:
COc1ccc(cc1)C(CNCCc1ccccc1)N1CCN(CC1)C1CCCCC1
: