Target
C-C chemokine receptor type 3
Ligand
BDBM50162417
Substrate
Meas. Tech.
ChEMBL_303563 (CHEMBL828963)
Ki
910.0±n/a nM
Citation
 Vedani, ADobler, MDollinger, HHasselbach, KMBirke, FLill, MA Novel ligands for the chemokine receptor-3 (CCR3): a receptor-modeling study based on 5D-QSAR. J Med Chem 48:1515-27 (2005)  
Target
Name:
C-C chemokine receptor type 3
Synonyms:
C-C CKR-3 CC-CKR-3 CCR3 CD_antigen=CD193 CMKBR3 | Eosinophil eotaxin receptor
Type:
Enzyme
Mol. Mass.:
41053.88
Organism:
Homo sapiens (Human)
Description:
P51677
Residue:
355
  
Inhibitor
Name:
BDBM50162417
Synonyms:
1-(4-tert-Butyl-phenyl)-3-[2-(4-cyclohexyl-piperazin-1-yl)-2-(4-methoxy-phenyl)-ethyl]-urea | CHEMBL194022
Type:
Small organic molecule
Emp. Form.:
C30H44N4O2
Mol. Mass.:
492.696
SMILES:
COc1ccc(cc1)C(CNC(=O)Nc1ccc(cc1)C(C)(C)C)N1CCN(CC1)C1CCCCC1
: