Target
C-C chemokine receptor type 3
Ligand
BDBM50162421
Substrate
Meas. Tech.
ChEMBL_303563 (CHEMBL828963)
Ki
1130±n/a nM
Citation
 Vedani, ADobler, MDollinger, HHasselbach, KMBirke, FLill, MA Novel ligands for the chemokine receptor-3 (CCR3): a receptor-modeling study based on 5D-QSAR. J Med Chem 48:1515-27 (2005)  
Target
Name:
C-C chemokine receptor type 3
Synonyms:
C-C CKR-3 CC-CKR-3 CCR3 CD_antigen=CD193 CMKBR3 | Eosinophil eotaxin receptor
Type:
Enzyme
Mol. Mass.:
41053.88
Organism:
Homo sapiens (Human)
Description:
P51677
Residue:
355
  
Inhibitor
Name:
BDBM50162421
Synonyms:
1-[2-(4-tert-Butyl-phenyl)-2-(4-cyclohexyl-piperazin-1-yl)-ethyl]-3-phenyl-urea | CHEMBL195427
Type:
Small organic molecule
Emp. Form.:
C29H42N4O
Mol. Mass.:
462.67
SMILES:
CC(C)(C)c1ccc(cc1)C(CNC(=O)Nc1ccccc1)N1CCN(CC1)C1CCCCC1
: