Target
Tryptase beta-2
Ligand
BDBM50162771
Substrate
Meas. Tech.
ChEMBL_304961 (CHEMBL827839)
IC50
19900±n/a nM
Citation
 del Fresno, MFernández-Forner, DMiralpeix, MSegarra, VRyder, HRoyo, MAlbericio, F Combinatorial approaches towards the discovery of new tryptase inhibitors. Bioorg Med Chem Lett 15:1659-64 (2005)  
Target
Name:
Tryptase beta-2
Synonyms:
TPS2 TRYB2_HUMAN Tryptase II Tryptase-2
Type:
PROTEIN
Mol. Mass.:
30518.79
Organism:
Homo sapiens (Human)
Description:
ChEMBL_210702
Residue:
275
  
Inhibitor
Name:
BDBM50162771
Synonyms:
CHEMBL181234 | N-(3-Carbamimidoyl-phenyl)-2-{(2S,5S)-5-[4-(2-guanidino-acetylamino)-butyl]-3,6-dioxo-piperazin-2-yl}-acetamide
Type:
Small organic molecule
Emp. Form.:
C20H29N9O4
Mol. Mass.:
459.5022
SMILES:
NC(=N)NCC(=O)NCCCC[C@@H]1NC(=O)[C@H](CC(=O)Nc2cccc(c2)C(N)=N)NC1=O
: