Target
Estrogen receptor beta
Ligand
BDBM50162796
Substrate
Meas. Tech.
ChEMBL_305431 (CHEMBL830924)
IC50
26±n/a nM
Citation
 Tan, QBlizzard, TAMorgan, JDBirzin, ETChan, WYang, YTPai, LYHayes, ECDaSilva, CAWarrier, SYudkovitz, JWilkinson, HASharma, NFitzgerald, PMLi, SColwell, LFisher, JEAdamski, SReszka, AAKimmel, DDiNinno, FRohrer, SPFreedman, LPSchaeffer, JMHammond, ML Estrogen receptor ligands. Part 10: Chromanes: old scaffolds for new SERAMs. Bioorg Med Chem Lett 15:1675-81 (2005)  
Target
Name:
Estrogen receptor beta
Synonyms:
ER-beta ESR2_HUMAN Estradiol receptor beta (ERβ) Estrogen receptor (ER beta) Estrogen receptor beta (ER beta) NR3A2 estrogen beta
Type:
Protein
Mol. Mass.:
59238.43
Organism:
Homo sapiens (Human)
Description:
Q92731
Residue:
530
  
Inhibitor
Name:
BDBM50162796
Synonyms:
(2R,3R,4S)-5-Fluoro-3-(4-hydroxy-phenyl)-4-methyl-2-{4-[(S)-2-((R)-3-methyl-pyrrolidin-1-yl)-propoxy]-phenyl}-chroman-6-ol | CHEMBL180995
Type:
Small organic molecule
Emp. Form.:
C30H34FNO4
Mol. Mass.:
491.5937
SMILES:
C[C@@H](COc1ccc(cc1)[C@@H]1Oc2ccc(O)c(F)c2[C@@H](C)[C@@H]1c1ccc(O)cc1)N1CC[C@@H](C)C1
: