Target
Estrogen receptor beta
Ligand
BDBM50162805
Substrate
Meas. Tech.
ChEMBL_305431 (CHEMBL830924)
IC50
11±n/a nM
Citation
 Tan, QBlizzard, TAMorgan, JDBirzin, ETChan, WYang, YTPai, LYHayes, ECDaSilva, CAWarrier, SYudkovitz, JWilkinson, HASharma, NFitzgerald, PMLi, SColwell, LFisher, JEAdamski, SReszka, AAKimmel, DDiNinno, FRohrer, SPFreedman, LPSchaeffer, JMHammond, ML Estrogen receptor ligands. Part 10: Chromanes: old scaffolds for new SERAMs. Bioorg Med Chem Lett 15:1675-81 (2005)  
Target
Name:
Estrogen receptor beta
Synonyms:
ER-beta ESR2_HUMAN Estradiol receptor beta (ERβ) Estrogen receptor (ER beta) Estrogen receptor beta (ER beta) NR3A2 estrogen beta
Type:
Protein
Mol. Mass.:
59238.43
Organism:
Homo sapiens (Human)
Description:
Q92731
Residue:
530
  
Inhibitor
Name:
BDBM50162805
Synonyms:
(2R,3R,4S)-5-Fluoro-3-(4-hydroxy-phenyl)-4-methyl-2-[4-(2-pyrrolidin-1-yl-ethoxy)-phenyl]-chroman-6-ol | CHEMBL181369
Type:
Small organic molecule
Emp. Form.:
C28H30FNO4
Mol. Mass.:
463.5405
SMILES:
C[C@H]1[C@@H]([C@@H](Oc2ccc(O)c(F)c12)c1ccc(OCCN2CCCC2)cc1)c1ccc(O)cc1
: