Target
Estrogen receptor
Ligand
BDBM50162804
Substrate
Meas. Tech.
ChEMBL_305467 (CHEMBL831077)
IC50
0.5±n/a nM
Citation
 Tan, QBlizzard, TAMorgan, JDBirzin, ETChan, WYang, YTPai, LYHayes, ECDaSilva, CAWarrier, SYudkovitz, JWilkinson, HASharma, NFitzgerald, PMLi, SColwell, LFisher, JEAdamski, SReszka, AAKimmel, DDiNinno, FRohrer, SPFreedman, LPSchaeffer, JMHammond, ML Estrogen receptor ligands. Part 10: Chromanes: old scaffolds for new SERAMs. Bioorg Med Chem Lett 15:1675-81 (2005)  
Target
Name:
Estrogen receptor
Synonyms:
ER ESR ESR1_HUMAN Estrogen receptor Estrogen receptor (ER-alpha) Estrogen receptor alpha (ER) Nuclear receptor subfamily 3 group A member 1
Type:
Protein
Mol. Mass.:
66230.44
Organism:
Homo sapiens (Human)
Description:
P03372
Residue:
595
  
Inhibitor
Name:
BDBM50162804
Synonyms:
(2R,3R,4S)-5-Fluoro-3-(4-hydroxy-phenyl)-4-methyl-2-[4-((S)-2-pyrrolidin-1-yl-propoxy)-phenyl]-chroman-6-ol | CHEMBL359633
Type:
Small organic molecule
Emp. Form.:
C29H32FNO4
Mol. Mass.:
477.5671
SMILES:
C[C@@H](COc1ccc(cc1)[C@@H]1Oc2ccc(O)c(F)c2[C@@H](C)[C@@H]1c1ccc(O)cc1)N1CCCC1
: