Target
Estrogen receptor beta
Ligand
BDBM50162811
Substrate
Meas. Tech.
ChEMBL_305431 (CHEMBL830924)
IC50
19±n/a nM
Citation
 Tan, QBlizzard, TAMorgan, JDBirzin, ETChan, WYang, YTPai, LYHayes, ECDaSilva, CAWarrier, SYudkovitz, JWilkinson, HASharma, NFitzgerald, PMLi, SColwell, LFisher, JEAdamski, SReszka, AAKimmel, DDiNinno, FRohrer, SPFreedman, LPSchaeffer, JMHammond, ML Estrogen receptor ligands. Part 10: Chromanes: old scaffolds for new SERAMs. Bioorg Med Chem Lett 15:1675-81 (2005)  
Target
Name:
Estrogen receptor beta
Synonyms:
ER-beta ESR2_HUMAN Estradiol receptor beta (ERβ) Estrogen receptor (ER beta) Estrogen receptor beta (ER beta) NR3A2 estrogen beta
Type:
Protein
Mol. Mass.:
59238.43
Organism:
Homo sapiens (Human)
Description:
Q92731
Residue:
530
  
Inhibitor
Name:
BDBM50162811
Synonyms:
(2R,3R,4S)-3-(4-Hydroxy-phenyl)-4-methyl-2-{4-[2-((S)-3-methyl-pyrrolidin-1-yl)-ethoxy]-phenyl}-chroman-6-ol | CHEMBL433581
Type:
Small organic molecule
Emp. Form.:
C29H33NO4
Mol. Mass.:
459.5766
SMILES:
C[C@H]1CCN(CCOc2ccc(cc2)[C@@H]2Oc3ccc(O)cc3[C@@H](C)[C@@H]2c2ccc(O)cc2)C1
: