Target
Insulin receptor
Ligand
BDBM50162990
Substrate
Meas. Tech.
ChEMBL_305383 (CHEMBL832897)
IC50
>10000±n/a nM
Citation
 Zhang, HCDerian, CKMcComsey, DFWhite, KBYe, HHecker, LRLi, JAddo, MFCroll, DEckardt, AJSmith, CELi, QCheung, WMConway, BREmanuel, SDemarest, KTAndrade-Gordon, PDamiano, BPMaryanoff, BE Novel indolylindazolylmaleimides as inhibitors of protein kinase C-beta: synthesis, biological activity, and cardiovascular safety. J Med Chem 48:1725-8 (2005)  
Target
Name:
Insulin receptor
Synonyms:
CD_antigen=CD220 IR Insulin receptor subunit alpha | Insulin receptor subunit beta
Type:
PROTEIN
Mol. Mass.:
155593.32
Organism:
Mus musculus
Description:
ChEMBL_305383
Residue:
1372
  
Inhibitor
Name:
BDBM50162990
Synonyms:
3-[1-(3-Dimethylamino-propyl)-1H-indazol-3-yl]-4-(1-quinolin-3-yl-1H-indol-3-yl)-pyrrole-2,5-dione | CHEMBL359486
Type:
Small organic molecule
Emp. Form.:
C33H28N6O2
Mol. Mass.:
540.6144
SMILES:
CN(C)CCCn1nc(C2=C(C(=O)NC2=O)c2cn(-c3cnc4ccccc4c3)c3ccccc23)c2ccccc12
: