Target
Liver carboxylesterase 1
Ligand
BDBM23316
Substrate
Meas. Tech.
ChEMBL_305509 (CHEMBL831110)
IC50
3±n/a nM
Citation
 Boger, DLMiyauchi, HDu, WHardouin, CFecik, RACheng, HHwang, IHedrick, MPLeung, DAcevedo, OGuimarães, CRJorgensen, WLCravatt, BF Discovery of a potent, selective, and efficacious class of reversible alpha-ketoheterocycle inhibitors of fatty acid amide hydrolase effective as analgesics. J Med Chem 48:1849-56 (2005)  
Target
Name:
Liver carboxylesterase 1
Synonyms:
Acyl coenzyme A:cholesterol acyltransferase CES1 EST1_HUMAN Serine hydrolase (CES1)
Type:
Protein
Mol. Mass.:
62520.83
Organism:
Homo sapiens (Human)
Description:
Residue:
567
  
Inhibitor
Name:
BDBM23316
Synonyms:
7-phenyl-1-{pyrido[2,3-d][1,3]oxazol-2-yl}heptan-1-one OL-92
Type:
Small organic molecule
Emp. Form.:
C19H20N2O2
Mol. Mass.:
308.3743
SMILES:
O=C(CCCCCCc1ccccc1)c1nc2ncccc2o1
: