Target
Fatty-acid amide hydrolase 1
Ligand
BDBM23316
Substrate
Meas. Tech.
ChEMBL_305543 (CHEMBL828563)
IC50
0.3±n/a nM
Citation
 Boger, DLMiyauchi, HDu, WHardouin, CFecik, RACheng, HHwang, IHedrick, MPLeung, DAcevedo, OGuimarães, CRJorgensen, WLCravatt, BF Discovery of a potent, selective, and efficacious class of reversible alpha-ketoheterocycle inhibitors of fatty acid amide hydrolase effective as analgesics. J Med Chem 48:1849-56 (2005)  
Target
Name:
Fatty-acid amide hydrolase 1
Synonyms:
Anandamide amidohydrolase FAAH FAAH1_HUMAN Fatty-acid amide hydrolase (FAAH) Oleamide hydrolase 1
Type:
Protein
Mol. Mass.:
63071.19
Organism:
Homo sapiens (Human)
Description:
O00519
Residue:
579
  
Inhibitor
Name:
BDBM23316
Synonyms:
7-phenyl-1-{pyrido[2,3-d][1,3]oxazol-2-yl}heptan-1-one OL-92
Type:
Small organic molecule
Emp. Form.:
C19H20N2O2
Mol. Mass.:
308.3743
SMILES:
O=C(CCCCCCc1ccccc1)c1nc2ncccc2o1
: