Target
Liver carboxylesterase 1
Ligand
BDBM50163190
Substrate
Meas. Tech.
ChEMBL_305509 (CHEMBL831110)
IC50
4±n/a nM
Citation
 Boger, DLMiyauchi, HDu, WHardouin, CFecik, RACheng, HHwang, IHedrick, MPLeung, DAcevedo, OGuimarães, CRJorgensen, WLCravatt, BF Discovery of a potent, selective, and efficacious class of reversible alpha-ketoheterocycle inhibitors of fatty acid amide hydrolase effective as analgesics. J Med Chem 48:1849-56 (2005)  
Target
Name:
Liver carboxylesterase 1
Synonyms:
Acyl coenzyme A:cholesterol acyltransferase CES1 EST1_HUMAN Serine hydrolase (CES1)
Type:
Protein
Mol. Mass.:
62520.83
Organism:
Homo sapiens (Human)
Description:
Residue:
567
  
Inhibitor
Name:
BDBM50163190
Synonyms:
2,2,2-Trifluoro-1-phenyl-ethanone | CHEMBL293277
Type:
Small organic molecule
Emp. Form.:
C8H5F3O
Mol. Mass.:
174.1199
SMILES:
FC(F)(F)C(=O)c1ccccc1
: