Target
Alpha-2C adrenergic receptor
Ligand
BDBM50131357
Substrate
Meas. Tech.
ChEMBL_303466 (CHEMBL838762)
Ki
19±n/a nM
Citation
 Andrés, JIAlcázar, JAlonso, JMAlvarez, RMBakker, MHBiesmans, ICid, JMDe Lucas, AIFernández, JFont, LMHens, KAIturrino, LLenaerts, IMartínez, SMegens, AAPastor, JVermote, PCSteckler, T Discovery of a new series of centrally active tricyclic isoxazoles combining serotonin (5-HT) reuptake inhibition with alpha2-adrenoceptor blocking activity. J Med Chem 48:2054-71 (2005)  
Target
Name:
Alpha-2C adrenergic receptor
Synonyms:
ADA2C_HUMAN ADRA2L2 Adrenergic alpha2C Adrenergic receptor alpha Alpha-2 adrenergic receptor subtype C4 Alpha-2C adrenoreceptor | adrenergic, alpha-2C-, receptor [Homo sapiens]
Type:
Enzyme
Mol. Mass.:
49552.32
Organism:
Homo sapiens (Human)
Description:
P18825
Residue:
462
  
Inhibitor
Name:
BDBM50131357
Synonyms:
4-(5-Fluoro-indan-2-ylmethyl)-4,5-dihydro-1H-imidazole S-34324
Type:
Small organic molecule
Emp. Form.:
C13H15FN2
Mol. Mass.:
218.27
SMILES:
Fc1ccc2CC(CC3CNC=N3)Cc2c1
: