Target
C-C chemokine receptor type 3
Ligand
BDBM50410322
Substrate
Meas. Tech.
ChEMBL_306872 (CHEMBL828678)
IC50
0.045000±n/a nM
Citation
 De Lucca, GVKim, UTVargo, BJDuncia, JVSantella, JBGardner, DSZheng, CLiauw, AWang, ZEmmett, GWacker, DAWelch, PKCovington, MStowell, NCWadman, EADas, AMDavies, PYeleswaram, SGraden, DMSolomon, KANewton, RCTrainor, GLDecicco, CPKo, SS Discovery of CC chemokine receptor-3 (CCR3) antagonists with picomolar potency. J Med Chem 48:2194-211 (2005)  
Target
Name:
C-C chemokine receptor type 3
Synonyms:
C-C CKR-3 CC-CKR-3 CCR3 CD_antigen=CD193 CMKBR3 | Eosinophil eotaxin receptor
Type:
Enzyme
Mol. Mass.:
41053.88
Organism:
Homo sapiens (Human)
Description:
P51677
Residue:
355
  
Inhibitor
Name:
BDBM50410322
Synonyms:
CHEMBL2113077
Type:
Small organic molecule
Emp. Form.:
C27H34FN5O
Mol. Mass.:
463.5902
SMILES:
Fc1ccc(C[C@@H]2CCCN(C[C@@H]3CCCC[C@H]3NC(=O)Nc3ccc4[nH]ncc4c3)C2)cc1
: