Target
C-C chemokine receptor type 3
Ligand
BDBM50163650
Substrate
Meas. Tech.
ChEMBL_306872 (CHEMBL828678)
IC50
0.007000±n/a nM
Citation
 De Lucca, GVKim, UTVargo, BJDuncia, JVSantella, JBGardner, DSZheng, CLiauw, AWang, ZEmmett, GWacker, DAWelch, PKCovington, MStowell, NCWadman, EADas, AMDavies, PYeleswaram, SGraden, DMSolomon, KANewton, RCTrainor, GLDecicco, CPKo, SS Discovery of CC chemokine receptor-3 (CCR3) antagonists with picomolar potency. J Med Chem 48:2194-211 (2005)  
Target
Name:
C-C chemokine receptor type 3
Synonyms:
C-C CKR-3 CC-CKR-3 CCR3 CD_antigen=CD193 CMKBR3 | Eosinophil eotaxin receptor
Type:
Enzyme
Mol. Mass.:
41053.88
Organism:
Homo sapiens (Human)
Description:
P51677
Residue:
355
  
Inhibitor
Name:
BDBM50163650
Synonyms:
1-(3,5-Diacetyl-phenyl)-3-{(1R,2S)-2-[(S)-3-(4-fluoro-benzyl)-piperidin-1-ylmethyl]-cyclohexyl}-urea | CHEMBL193575
Type:
Small organic molecule
Emp. Form.:
C30H38FN3O3
Mol. Mass.:
507.6394
SMILES:
CC(=O)c1cc(NC(=O)N[C@@H]2CCCC[C@H]2CN2CCC[C@@H](Cc3ccc(F)cc3)C2)cc(c1)C(C)=O
: