Target
Matrix metalloproteinase-14
Ligand
BDBM50163809
Substrate
Meas. Tech.
ChEMBL_305128 (CHEMBL832424)
IC50
3±n/a nM
Citation
 Blagg, JANoe, MCWolf-Gouveia, LAReiter, LALaird, ERChang, SPDanley, DEDowns, JTElliott, NCEskra, JDGriffiths, RJHardink, JRHaugeto, AIJones, CSLiras, JLLopresti-Morrow, LLMitchell, PGPandit, JRobinson, RPSubramanyam, CVaughn-Bowser, MLYocum, SA Potent pyrimidinetrione-based inhibitors of MMP-13 with enhanced selectivity over MMP-14. Bioorg Med Chem Lett 15:1807-10 (2005)  
Target
Name:
Matrix metalloproteinase-14
Synonyms:
MMP-14 MMP14 MT-MMP 1 MT1MMP Matrix Metalloproteinase-14 (MMP-14) Matrix metalloproteinase-14 Membrane-type matrix metalloproteinase 1 | Membrane-type-1 matrix metalloproteinase
Type:
Protein
Mol. Mass.:
65900.19
Organism:
Homo sapiens (Human)
Description:
P50281
Residue:
582
  
Inhibitor
Name:
BDBM50163809
Synonyms:
5-Amino-3-(2-ethoxy-ethyl)-3-[4-(4-oxazol-5-yl-phenoxy)-phenoxy]-piperidine-2,4,6-trione | CHEMBL367133
Type:
Small organic molecule
Emp. Form.:
C24H23N3O7
Mol. Mass.:
465.4553
SMILES:
CCOCCC1(Oc2ccc(Oc3ccc(cc3)-c3cnco3)cc2)C(=O)NC(=O)C(N)C1=O
: