Target
Peroxisome proliferator-activated receptor gamma
Ligand
BDBM28700
Substrate
Meas. Tech.
ChEMBL_306293 (CHEMBL828585)
IC50
>50000±n/a nM
Citation
 Liu, KXu, LBerger, JPMacnaul, KLZhou, GDoebber, TWForrest, MJMoller, DEJones, AB Discovery of a novel series of peroxisome proliferator-activated receptor alpha/gamma dual agonists for the treatment of type 2 diabetes and dyslipidemia. J Med Chem 48:2262-5 (2005)  
Target
Name:
Peroxisome proliferator-activated receptor gamma
Synonyms:
NR1C3 PPAR-gamma PPARG_HUMAN Peroxisome proliferator-activated receptor gamma (PPAR gamma) Peroxisome proliferator-activated receptor gamma (PPARĪ³) peroxisome proliferator-activated receptor gamma isoform 2
Type:
Nuclear Receptor
Mol. Mass.:
57613.46
Organism:
Homo sapiens (Human)
Description:
P37231
Residue:
505
  
Inhibitor
Name:
BDBM28700
Synonyms:
2-(4-(4-Chlorobenzoyl)phenoxy)-2-methylpropionic acid CHEMBL981 FIBRICOR LF 153 procetofenic acid
Type:
Small organic molecule
Emp. Form.:
C17H15ClO4
Mol. Mass.:
318.752
SMILES:
CC(C)(Oc1ccc(cc1)C(=O)c1ccc(Cl)cc1)C(O)=O
: