Target
Mitogen-activated protein kinase 14
Ligand
BDBM50164232
Substrate
Meas. Tech.
ChEMBL_306714 (CHEMBL832299)
IC50
4.9±n/a nM
Citation
 de Dios, AShih, CLópez de Uralde, BSánchez, Cdel Prado, MMartín Cabrejas, LMPleite, SBlanco-Urgoiti, JLorite, MJNevill, CRBonjouklian, RYork, JVieth, MWang, YMagnus, NCampbell, RMAnderson, BDMcCann, DJGiera, DDLee, PASchultz, RMLi, LCJohnson, LMWolos, JA Design of potent and selective 2-aminobenzimidazole-based p38alpha MAP kinase inhibitors with excellent in vivo efficacy. J Med Chem 48:2270-3 (2005)  
Target
Name:
Mitogen-activated protein kinase 14
Synonyms:
CSAID-binding protein CSBP1 CSPB1 MAP kinase 14 MAP kinase p38 alpha MAPK14 MK14_HUMAN Mitogen-activated protein kinase p38 alpha Stress-activated protein kinase 2a | p38 MAP kinase alpha/beta
Type:
Serine/threonine-protein kinase
Mol. Mass.:
41286.76
Organism:
Homo sapiens (Human)
Description:
Q16539
Residue:
360
  
Inhibitor
Name:
BDBM50164232
Synonyms:
6-(2-(2,6-difluorophenyl)-4-phenyl-1H-imidazol-5-yl)-1-(isopropylsulfonyl)-1H-benzo[d]imidazol-2-amine CHEMBL364572
Type:
Small organic molecule
Emp. Form.:
C25H21F2N5O2S
Mol. Mass.:
493.528
SMILES:
CC(C)S(=O)(=O)n1c(N)nc2ccc(cc12)-c1[nH]c(nc1-c1ccccc1)-c1c(F)cccc1F
: