Target
Melanin-concentrating hormone receptor 2
Ligand
BDBM50164249
Substrate
Meas. Tech.
ChEMBL_302592 (CHEMBL839552)
Ki
>3000±n/a nM
Citation
 McBriar, MDGuzik, HXu, RParuchova, JLi, SPalani, AClader, JWGreenlee, WJHawes, BEKowalski, TJO'Neill, KSpar, BWeig, B Discovery of bicycloalkyl urea melanin concentrating hormone receptor antagonists: orally efficacious antiobesity therapeutics. J Med Chem 48:2274-7 (2005)  
Target
Name:
Melanin-concentrating hormone receptor 2
Synonyms:
GPR145 MCHR2_HUMAN Melanin-concentrating hormone receptor SLT
Type:
Enzyme Catalytic Domain
Mol. Mass.:
38862.16
Organism:
Homo sapiens (Human)
Description:
Melanin Concentrating Hormone 2 GPR145 HUMAN::Q969V1
Residue:
340
  
Inhibitor
Name:
BDBM50164249
Synonyms:
1-[4-(3-Cyano-phenyl)-4-methyl-cyclohexyl]-3-(4-fluoro-3-trifluoromethyl-phenyl)-1-[2-((R)-3-hydroxy-pyrrolidin-1-yl)-ethyl]-urea | CHEMBL191388
Type:
Small organic molecule
Emp. Form.:
C28H32F4N4O2
Mol. Mass.:
532.5729
SMILES:
C[C@@]1(CC[C@@H](CC1)N(CCN1CC[C@@H](O)C1)C(=O)Nc1ccc(F)c(c1)C(F)(F)F)c1cccc(c1)C#N
: