Target
D(1A) dopamine receptor
Ligand
BDBM50164344
Substrate
Meas. Tech.
ChEMBL_303248 (CHEMBL827213)
Ki
>10000±n/a nM
Citation
 Patanè, EPittalà, VGuerrera, FSalerno, LRomeo, GSiracusa, MARusso, FManetti, FBotta, MMereghetti, ICagnotto, AMennini, T Synthesis of 3-arylpiperazinylalkylpyrrolo[3,2-d]pyrimidine-2,4-dione derivatives as novel, potent, and selective alpha1-adrenoceptor ligands. J Med Chem 48:2420-31 (2005)  
Target
Name:
D(1A) dopamine receptor
Synonyms:
DOPAMINE D1 Dopamine D1 high Dopamine receptor Dopamine1-like Drd1a
Type:
Enzyme Catalytic Domain
Mol. Mass.:
49429.75
Organism:
RAT
Description:
P18901
Residue:
446
  
Inhibitor
Name:
BDBM50164344
Synonyms:
3-{2-[4-(2-Chloro-phenyl)-piperazin-1-yl]-ethyl}-1,5-dihydro-pyrrolo[3,2-d]pyrimidine-2,4-dione | CHEMBL190384
Type:
Small organic molecule
Emp. Form.:
C18H20ClN5O2
Mol. Mass.:
373.837
SMILES:
Clc1ccccc1N1CCN(CCn2c(=O)[nH]c3cc[nH]c3c2=O)CC1
: