Target
Cyclin-dependent kinase 1
Ligand
BDBM50164711
Substrate
Meas. Tech.
ChEMBL_304675 (CHEMBL827874)
IC50
4±n/a nM
Citation
 Verma, SNagarathnam, DShao, JZhang, LZhao, JWang, YLi, TMull, EEnyedy, IWang, CZhu, QAltieri, MJordan, JDang, TTReddy, S Substituted aminobenzimidazole pyrimidines as cyclin-dependent kinase inhibitors. Bioorg Med Chem Lett 15:1973-7 (2005)  
Target
Name:
Cyclin-dependent kinase 1
Synonyms:
CDC2 CDK1 CDKN1 Cell division protein kinase 1 P34CDC2 | p34 protein kinase
Type:
Enzyme Subunit
Mol. Mass.:
34101.08
Organism:
Homo sapiens (Human)
Description:
P06493
Residue:
297
  
Inhibitor
Name:
BDBM50164711
Synonyms:
CHEMBL195423 | N*2*-(3H-Benzoimidazol-5-yl)-5-bromo-N*4*-(4-fluoro-phenyl)-pyrimidine-2,4-diamine
Type:
Small organic molecule
Emp. Form.:
C17H12BrFN6
Mol. Mass.:
399.22
SMILES:
Fc1ccc(Nc2nc(Nc3ccc4nc[nH]c4c3)ncc2Br)cc1
: