Target
Cystic fibrosis transmembrane conductance regulator
Ligand
BDBM50164996
Substrate
Meas. Tech.
ChEMBL_310547 (CHEMBL833631)
EC50
66±n/a nM
Citation
 Hirth, BHQiao, SCuff, LMCochran, BMPregel, MJGregory, JSSneddon, SFKane, JL Discovery of 1,2,3,4-tetrahydroisoquinoline-3-carboxylic acid diamides that increase CFTR mediated chloride transport. Bioorg Med Chem Lett 15:2087-91 (2005)  
Target
Name:
Cystic fibrosis transmembrane conductance regulator
Synonyms:
ABCC7 CFTR Channel conductance-controlling ATPase | cAMP-dependent chloride channel
Type:
Enzyme Catalytic Domain
Mol. Mass.:
168171.30
Organism:
Homo sapiens (Human)
Description:
gi_90421313
Residue:
1480
  
Inhibitor
Name:
BDBM50164996
Synonyms:
(R)-2-(3-Phenoxy-benzoyl)-1,2,3,4-tetrahydro-isoquinoline-3-carboxylic acid [4-(acetyl-butyl-amino)-phenyl]-amide | CHEMBL195438
Type:
Small organic molecule
Emp. Form.:
C35H35N3O4
Mol. Mass.:
561.6701
SMILES:
CCCCN(C(C)=O)c1ccc(NC(=O)[C@H]2Cc3ccccc3CN2C(=O)c2cccc(Oc3ccccc3)c2)cc1
: