Target
Glucocorticoid receptor
Ligand
BDBM50165102
Substrate
Meas. Tech.
ChEMBL_304255 (CHEMBL829726)
EC50
5±n/a nM
Citation
 Thompson, CFQuraishi, NAli, ATata, JRHammond, MLBalkovec, JMEinstein, MGe, LHarris, GKelly, TMMazur, PPandit, SSantoro, JSitlani, AWang, CWilliamson, JMiller, DKYamin, TTThompson, CMO'Neill, EAZaller, DForrest, MJCarballo-Jane, ELuell, S Novel heterocyclic glucocorticoids: in vitro profile and in vivo efficacy. Bioorg Med Chem Lett 15:2163-7 (2005)  
Target
Name:
Glucocorticoid receptor
Synonyms:
GCR_MOUSE Glucocorticoid receptor Grl1 | Nr3c1
Type:
Enzyme Catalytic Domain
Mol. Mass.:
86050.26
Organism:
MOUSE
Description:
Glucocorticoid 0 MOUSE::P06537
Residue:
783
  
Inhibitor
Name:
BDBM50165102
Synonyms:
(S)-[(4aR,5S)-1-(4-Fluoro-phenyl)-4a-methyl-4,4a,5,6,7,8-hexahydro-1H-benzo[f]indazol-5-yl]-(6-fluoro-pyridin-3-yl)-methanol | CHEMBL364015
Type:
Small organic molecule
Emp. Form.:
C24H23F2N3O
Mol. Mass.:
407.4557
SMILES:
C[C@]12Cc3cnn(c3C=C1CCC[C@@H]2[C@H](O)c1ccc(F)nc1)-c1ccc(F)cc1
: