Target
Heat shock protein HSP 90-alpha/90-beta
Ligand
BDBM50165269
Substrate
Meas. Tech.
ChEMBL_305419 (CHEMBL830912)
IC50
110300±n/a nM
Citation
 Llauger, LHe, HKim, JAguirre, JRosen, NPeters, UDavies, PChiosis, G Evaluation of 8-arylsulfanyl, 8-arylsulfoxyl, and 8-arylsulfonyl adenine derivatives as inhibitors of the heat shock protein 90. J Med Chem 48:2892-905 (2005)  
Target
Name:
Heat shock protein HSP 90-alpha/90-beta
Synonyms:
Heat Shock Protein 90 (Hsp90) Heat shock protein HSP90
Type:
Mol. Mass.:
Description:
ASSAY_ID of EBI is 29664
Components:
This complex has 2 components.
Component 1
Name:
Heat shock protein HSP 90-alpha
Synonyms:
HS90A_HUMAN HSP86 HSP90AA1 HSPCA Heat shock 86 kDa Heat shock protein HSP 90-alpha (HSP90) LAP-2 Lipopolysaccharide-associated protein 2 heat shock protein 90kDa alpha (cytosolic), class A member 1 isoform 2
Type:
Molecular Chaperone
Mol. Mass.:
84623.45
Organism:
Homo sapiens (Human)
Description:
P07900
Residue:
732
  
Component 2
Name:
Heat shock protein HSP 90-beta
Synonyms:
HS90B_HUMAN HSP 90 HSP90B HSPCB Heat shock protein HSP 90 (Hsp90)
Type:
Molecular Chaperone
Mol. Mass.:
83229.45
Organism:
Homo sapiens (Human)
Description:
P08238
Residue:
724
  
Inhibitor
Name:
BDBM50165269
Synonyms:
9-Butyl-8-(3,4,5-trimethoxy-benzenesulfinyl)-9H-purin-6-ylamine | CHEMBL192761
Type:
Small organic molecule
Emp. Form.:
C18H23N5O4S
Mol. Mass.:
405.471
SMILES:
CCCCn1c(nc2c(N)ncnc12)S(=O)c1cc(OC)c(OC)c(OC)c1
: