Target
Heat shock protein HSP 90-alpha
Ligand
BDBM50165290
Substrate
Meas. Tech.
ChEMBL_304333 (CHEMBL839760)
EC50
>100000±n/a nM
Citation
 Llauger, LHe, HKim, JAguirre, JRosen, NPeters, UDavies, PChiosis, G Evaluation of 8-arylsulfanyl, 8-arylsulfoxyl, and 8-arylsulfonyl adenine derivatives as inhibitors of the heat shock protein 90. J Med Chem 48:2892-905 (2005)  
Target
Name:
Heat shock protein HSP 90-alpha
Synonyms:
HS90A_MOUSE Hsp86-1 Hspca
Type:
PROTEIN
Mol. Mass.:
84750.61
Organism:
Mus musculus
Description:
ChEMBL_304333
Residue:
733
  
Inhibitor
Name:
BDBM50165290
Synonyms:
9-Pent-4-ynyl-8-(3,4,5-trimethoxy-phenylsulfanyl)-9H-purine-2,6-diamine | CHEMBL191835
Type:
Small organic molecule
Emp. Form.:
C19H22N6O3S
Mol. Mass.:
414.481
SMILES:
COc1cc(Sc2nc3c(N)nc(N)nc3n2CCCC#C)cc(OC)c1OC
: