Target
Heat shock protein HSP 90-alpha
Ligand
BDBM50165280
Substrate
Meas. Tech.
ChEMBL_304333 (CHEMBL839760)
EC50
>50000±n/a nM
Citation
 Llauger, LHe, HKim, JAguirre, JRosen, NPeters, UDavies, PChiosis, G Evaluation of 8-arylsulfanyl, 8-arylsulfoxyl, and 8-arylsulfonyl adenine derivatives as inhibitors of the heat shock protein 90. J Med Chem 48:2892-905 (2005)  
Target
Name:
Heat shock protein HSP 90-alpha
Synonyms:
HS90A_MOUSE Hsp86-1 Hspca
Type:
PROTEIN
Mol. Mass.:
84750.61
Organism:
Mus musculus
Description:
ChEMBL_304333
Residue:
733
  
Inhibitor
Name:
BDBM50165280
Synonyms:
9-Pent-4-ynyl-8-(3,4,5-trimethoxy-benzenesulfonyl)-9H-purin-6-ylamine | CHEMBL193310
Type:
Small organic molecule
Emp. Form.:
C19H21N5O5S
Mol. Mass.:
431.466
SMILES:
COc1cc(cc(OC)c1OC)S(=O)(=O)c1nc2c(N)ncnc2n1CCCC#C
: