Target
Heat shock protein HSP 90-alpha
Ligand
BDBM50165277
Substrate
Meas. Tech.
ChEMBL_304333 (CHEMBL839760)
EC50
2700±n/a nM
Citation
 Llauger, LHe, HKim, JAguirre, JRosen, NPeters, UDavies, PChiosis, G Evaluation of 8-arylsulfanyl, 8-arylsulfoxyl, and 8-arylsulfonyl adenine derivatives as inhibitors of the heat shock protein 90. J Med Chem 48:2892-905 (2005)  
Target
Name:
Heat shock protein HSP 90-alpha
Synonyms:
HS90A_MOUSE Hsp86-1 Hspca
Type:
PROTEIN
Mol. Mass.:
84750.61
Organism:
Mus musculus
Description:
ChEMBL_304333
Residue:
733
  
Inhibitor
Name:
BDBM50165277
Synonyms:
1-[4-(6-Amino-9-pent-4-ynyl-9H-purin-8-ylsulfanyl)-phenyl]-ethanone | CHEMBL363860
Type:
Small organic molecule
Emp. Form.:
C18H17N5OS
Mol. Mass.:
351.425
SMILES:
CC(=O)c1ccc(Sc2nc3c(N)ncnc3n2CCCC#C)cc1
: