Target
Sarcoplasmic/endoplasmic reticulum calcium ATPase 1
Ligand
BDBM50165369
Substrate
Meas. Tech.
ChEMBL_305449 (CHEMBL830124)
IC50
1.2±n/a nM
Citation
 Singh, PMhaka, AMChristensen, SBGray, JJDenmeade, SRIsaacs, JT Applying linear interaction energy method for rational design of noncompetitive allosteric inhibitors of the sarco- and endoplasmic reticulum calcium-ATPase. J Med Chem 48:3005-14 (2005)  
Target
Name:
Sarcoplasmic/endoplasmic reticulum calcium ATPase 1
Synonyms:
AT2A1_HUMAN | ATP2A1
Type:
PROTEIN
Mol. Mass.:
110227.58
Organism:
Homo sapiens (Human)
Description:
ChEMBL_305449
Residue:
1001
  
Inhibitor
Name:
BDBM50165369
Synonyms:
12-(4-Amino-4-carboxy-butyrylamino)-dodecanoic acid (2S,3aR,4S,6S,6aR,7S,9bS)-6-acetoxy-3,3a-dihydroxy-3,6,9-trimethyl-7-octanoyloxy-2,8-dioxo-2,3,3a,4,5,6,6a,7,8,9b-decahydro-azuleno[4,5-b]furan-4-yl ester | CHEMBL365703
Type:
Small organic molecule
Emp. Form.:
C42H66N2O14
Mol. Mass.:
822.9784
SMILES:
CCCCCCCC(=O)O[C@H]1[C@H]2C([C@@H]3OC(=O)[C@@](C)(O)[C@@]3(O)[C@H](C[C@]2(C)OC(C)=O)OC(=O)CCCCCCCCCCCNC(=O)CCC(N)C(O)=O)=C(C)C1=O
: