Target
P04972/P11541/P16586/P22571/P23439/Q95142
Ligand
BDBM14390
Substrate
Meas. Tech.
ChEMBL_304733 (CHEMBL829333)
IC50
40±n/a nM
Citation
 Feixas, JGiovannoni, MPVergelli, CGavaldà, ACesari, NGraziano, ADal Piaz, V New pyrazolo[1',5':1,6]pyrimido[4,5-d]pyridazin-4(3H)-ones as potent and selective PDE5 inhibitors. Bioorg Med Chem Lett 15:2381-4 (2005)  
Target
Name:
P04972/P11541/P16586/P22571/P23439/Q95142
Synonyms:
Phosphodiesterase 6
Type:
Mol. Mass.:
Description:
ASSAY_ID of ChEMBL is 155381
Components:
This complex has 6 components.
Component 1
Name:
Retinal rod rhodopsin-sensitive cGMP 3',5'-cyclic phosphodiesterase subunit gamma
Synonyms:
CNRG_BOVIN PDE6G | PDEG
Type:
PROTEIN
Mol. Mass.:
9674.16
Organism:
Bos taurus
Description:
ChEMBL_104859
Residue:
87
  
Component 2
Name:
Cone cGMP-specific 3',5'-cyclic phosphodiesterase subunit alpha'
Synonyms:
PDE V-C1 PDE6C_BOVIN cGMP phosphodiesterase 6C
Type:
PROTEIN
Mol. Mass.:
98783.85
Organism:
Bos taurus
Description:
ChEMBL_104859
Residue:
855
  
Component 3
Name:
Rod cGMP-specific 3',5'-cyclic phosphodiesterase subunit alpha
Synonyms:
PDE6A PDEA Phosphodiesterase 6A
Type:
Enzyme
Mol. Mass.:
99320.22
Organism:
Bos taurus (Bovine)
Description:
P11541
Residue:
859
  
Component 4
Name:
Retinal cone rhodopsin-sensitive cGMP 3',5'-cyclic phosphodiesterase subunit gamma
Synonyms:
CNCG_BOVIN PDE6H
Type:
PROTEIN
Mol. Mass.:
9106.39
Organism:
Bos taurus
Description:
ChEMBL_104859
Residue:
83
  
Component 5
Name:
Retinal rod rhodopsin-sensitive cGMP 3',5'-cyclic phosphodiesterase subunit delta
Synonyms:
GMP-PDE delta PDE6D_BOVIN
Type:
PROTEIN
Mol. Mass.:
17388.28
Organism:
Bos taurus
Description:
ChEMBL_104859
Residue:
150
  
Component 6
Name:
Rod cGMP-specific 3',5'-cyclic phosphodiesterase subunit beta
Synonyms:
GMP-PDE beta PDE6B_BOVIN | PDEB
Type:
PROTEIN
Mol. Mass.:
98307.54
Organism:
Bos taurus
Description:
ChEMBL_104859
Residue:
853
  
Inhibitor
Name:
BDBM14390
Synonyms:
5-[2-ethoxy-5-(4-methyl-1-piperazinylsulfonyl)phenyl]-1-methyl-3-n-propyl-1,6-dihydro-7H-pyrazolo[4,3-d]pyrimidin-7-one CHEMBL192 Sildenafil US11155558, Compound sildenafil Viagra
Type:
Small organic molecule
Emp. Form.:
C22H30N6O4S
Mol. Mass.:
474.576
SMILES:
CCCc1nn(C)c2c1nc([nH]c2=O)-c1cc(ccc1OCC)S(=O)(=O)N1CCN(C)CC1
: