Target
Melanocortin receptor 4
Ligand
BDBM50165933
Substrate
Meas. Tech.
ChEMBL_310337 (CHEMBL832471)
EC50
0.670000±n/a nM
Citation
 Mayer, JPHsiung, HMFlora, DBEdwards, PSmith, DPZhang, XYGadski, RAHeiman, MLHertel, JLEmmerson, PJHusain, SO'brien, TPKahl, SDSmiley, DLZhang, LDimarchi, RDYan, LZ Discovery of a beta-MSH-derived MC-4R selective agonist. J Med Chem 48:3095-8 (2005)  
Target
Name:
Melanocortin receptor 4
Synonyms:
MC4-R MC4R_HUMAN Melanocortin receptor 4 (MC-4) Melanocortin receptor 4 (MC4R)
Type:
Enzyme
Mol. Mass.:
36949.50
Organism:
Homo sapiens (Human)
Description:
P32245
Residue:
332
  
Inhibitor
Name:
BDBM50165933
Synonyms:
CHEMBL428326 | GPYRMEHFRWGSPPKD-NH2
Type:
Small organic molecule
Emp. Form.:
C89H127N27O22S
Mol. Mass.:
1959.193
SMILES:
CSCC[C@H](NC(=O)[C@H](CCCNC(N)=N)NC(=O)[C@H](Cc1ccc(O)cc1)NC(=O)[C@@H]1CCCN1C(=O)CN)C(=O)N[C@@H](CCC(O)=O)C(=O)N[C@@H](Cc1cnc[nH]1)C(=O)N[C@@H](Cc1ccccc1)C(=O)N[C@@H](CCCNC(N)=N)C(=O)N[C@@H](Cc1c[nH]c2ccccc12)C(=O)NCC(=O)N[C@@H](CO)C(=O)N1CCC[C@H]1C(=O)N1CCC[C@H]1C(=O)N[C@@H](CCCCN)C(=O)N[C@@H](CC(O)=O)C(N)=O
: