Target
D(1B) dopamine receptor
Ligand
BDBM50162869
Substrate
Meas. Tech.
ChEMBL_302994 (CHEMBL830233)
Ki
791±n/a nM
Citation
 Ding, KChen, JJi, MWu, XVarady, JYang, CYLu, YDeschamps, JRLevant, BWang, S Enantiomerically pure hexahydropyrazinoquinolines as potent and selective dopamine 3 subtype receptor ligands. J Med Chem 48:3171-81 (2005)  
Target
Name:
D(1B) dopamine receptor
Synonyms:
D(1B) dopamine receptor DRD5_RAT Dopamine D5 receptor Drd5
Type:
Enzyme Catalytic Domain
Mol. Mass.:
52827.88
Organism:
RAT
Description:
Dopamine D1B 0 RAT::P25115
Residue:
475
  
Inhibitor
Name:
BDBM50162869
Synonyms:
CHEMBL179757 Naphthalene-2-carboxylic acid [4-(1,2,4,4a,5,6-hexahydro-pyrazino[1,2-a]quinolin-3-yl)-butyl]-amide
Type:
Small organic molecule
Emp. Form.:
C27H31N3O
Mol. Mass.:
413.5545
SMILES:
O=C(NCCCCN1CCN2C(CCc3ccccc23)C1)c1ccc2ccccc2c1
: