Target
Choline kinase alpha
Ligand
BDBM50166189
Substrate
Meas. Tech.
ChEMBL_305138 (CHEMBL832433)
IC50
2300±n/a nM
Citation
 Sánchez-Martín, RCampos, JMConejo-García, ACruz-López, OBáñez-Coronel, MRodríguez-González, AGallo, MALacal, JCEspinosa, A Symmetrical bis-quinolinium compounds: new human choline kinase inhibitors with antiproliferative activity against the HT-29 cell line. J Med Chem 48:3354-63 (2005)  
Target
Name:
Choline kinase alpha
Synonyms:
CHK CHKA_HUMAN Choline kinase alpha
Type:
PROTEIN
Mol. Mass.:
52248.44
Organism:
Homo sapiens (Human)
Description:
ChEMBL_1290064
Residue:
457
  
Inhibitor
Name:
BDBM50166189
Synonyms:
Bisquinolinium derivative | CHEMBL364022
Type:
Small organic molecule
Emp. Form.:
C46H40N4
Mol. Mass.:
648.8355
SMILES:
C(Cc1ccc(Cn2cc\c(=[NH+]/c3ccccc3)c3ccccc23)cc1)c1ccc(Cn2cc\c(=[NH+]\c3ccccc3)c3ccccc23)cc1
: