Target
Choline kinase alpha
Ligand
BDBM50166177
Substrate
Meas. Tech.
ChEMBL_305138 (CHEMBL832433)
IC50
5700±n/a nM
Citation
 Sánchez-Martín, RCampos, JMConejo-García, ACruz-López, OBáñez-Coronel, MRodríguez-González, AGallo, MALacal, JCEspinosa, A Symmetrical bis-quinolinium compounds: new human choline kinase inhibitors with antiproliferative activity against the HT-29 cell line. J Med Chem 48:3354-63 (2005)  
Target
Name:
Choline kinase alpha
Synonyms:
CHK CHKA_HUMAN Choline kinase alpha
Type:
PROTEIN
Mol. Mass.:
52248.44
Organism:
Homo sapiens (Human)
Description:
ChEMBL_1290064
Residue:
457
  
Inhibitor
Name:
BDBM50166177
Synonyms:
Bisquinolinium derivative | CHEMBL364692
Type:
Small organic molecule
Emp. Form.:
C46H36Cl4N4
Mol. Mass.:
786.616
SMILES:
C\[N+](c1ccc(Cl)cc1)=c1\ccn(Cc2cccc(c2)-c2cccc(Cn3cc\c(=[N+](/C)c4ccc(Cl)cc4)c4ccc(Cl)cc34)c2)c2cc(Cl)ccc12
: