Target
Glutamate receptor 3
Ligand
BDBM17662
Substrate
Meas. Tech.
ChEMBL_303111 (CHEMBL876377)
Ki
20.6±n/a nM
Citation
 Vogensen, SBClausen, RPGreenwood, JRJohansen, TNPickering, DSNielsen, BEbert, BKrogsgaard-Larsen, P Convergent synthesis and pharmacology of substituted tetrazolyl-2-amino-3-(3-hydroxy-5-methyl-4-isoxazolyl)propionic acid analogues. J Med Chem 48:3438-42 (2005)  
Target
Name:
Glutamate receptor 3
Synonyms:
AMPA-selective glutamate receptor 3 GLURC GRIA3_HUMAN GluR-C Glutamate receptor 3 Glutamate receptor ionotropic, AMPA 3
Type:
PROTEIN
Mol. Mass.:
101172.14
Organism:
Homo sapiens (Human)
Description:
ChEMBL_468627
Residue:
894
  
Inhibitor
Name:
BDBM17662
Synonyms:
(2S)-2-amino-3-(3-hydroxy-5-methyl-1,2-oxazol-4-yl)propanoic acid AMPA | CHEMBL276815
Type:
Small organic molecule
Emp. Form.:
C7H10N2O4
Mol. Mass.:
186.1653
SMILES:
Cc1o[nH]c(=O)c1C[C@H](N)C(O)=O
: