Target
Peroxisome proliferator-activated receptor gamma
Ligand
BDBM50166301
Substrate
Meas. Tech.
ChEMBL_310661 (CHEMBL838008)
EC50
31±n/a nM
Citation
 Liu, KBlack, RMActon, JJMosley, RDebenham, SAbola, RYang, MTschirret-Guth, RColwell, LLiu, CWu, MWang, CFMacNaul, KLMcCann, MEMoller, DEBerger, JPMeinke, PTJones, ABWood, HB Selective PPARgamma modulators with improved pharmacological profiles. Bioorg Med Chem Lett 15:2437-40 (2005)  
Target
Name:
Peroxisome proliferator-activated receptor gamma
Synonyms:
NR1C3 PPAR-gamma PPARG_HUMAN Peroxisome proliferator-activated receptor gamma (PPAR gamma) Peroxisome proliferator-activated receptor gamma (PPARĪ³) peroxisome proliferator-activated receptor gamma isoform 2
Type:
Nuclear Receptor
Mol. Mass.:
57613.46
Organism:
Homo sapiens (Human)
Description:
P37231
Residue:
505
  
Inhibitor
Name:
BDBM50166301
Synonyms:
(4-Methoxy-phenyl)-[2-methyl-3-(3-prop-2-ynyloxy-benzyl)-5-trifluoromethoxy-indol-1-yl]-methanone | CHEMBL372913
Type:
Small organic molecule
Emp. Form.:
C28H22F3NO4
Mol. Mass.:
493.4738
SMILES:
COc1ccc(cc1)C(=O)n1c(C)c(Cc2cccc(OCC#C)c2)c2cc(OC(F)(F)F)ccc12
: