Target
Peroxisome proliferator-activated receptor gamma
Ligand
BDBM50166302
Substrate
Meas. Tech.
ChEMBL_310661 (CHEMBL838008)
EC50
39±n/a nM
Citation
 Liu, KBlack, RMActon, JJMosley, RDebenham, SAbola, RYang, MTschirret-Guth, RColwell, LLiu, CWu, MWang, CFMacNaul, KLMcCann, MEMoller, DEBerger, JPMeinke, PTJones, ABWood, HB Selective PPARgamma modulators with improved pharmacological profiles. Bioorg Med Chem Lett 15:2437-40 (2005)  
Target
Name:
Peroxisome proliferator-activated receptor gamma
Synonyms:
NR1C3 PPAR-gamma PPARG_HUMAN Peroxisome proliferator-activated receptor gamma (PPAR gamma) Peroxisome proliferator-activated receptor gamma (PPARĪ³) peroxisome proliferator-activated receptor gamma isoform 2
Type:
Nuclear Receptor
Mol. Mass.:
57613.46
Organism:
Homo sapiens (Human)
Description:
P37231
Residue:
505
  
Inhibitor
Name:
BDBM50166302
Synonyms:
(S)-2-{5-[1-(6-Chloro-benzo[d]isoxazol-3-yl)-2-methyl-5-trifluoromethoxy-1H-indol-3-ylmethyl]-2-propyl-phenoxy}-propionic acid | CHEMBL365315
Type:
Small organic molecule
Emp. Form.:
C29H24ClF3N2O6
Mol. Mass.:
588.959
SMILES:
CCCc1ccc(Oc2c(C)n(-c3noc4cc(Cl)ccc34)c3ccc(OC(F)(F)F)cc23)cc1O[C@@H](C)C(O)=O
: