Target
Dipeptidyl peptidase 4
Ligand
BDBM50166310
Substrate
Meas. Tech.
ChEMBL_305151 (CHEMBL876981)
IC50
3±n/a nM
Citation
 Sakashita, HKitajima, HNakamura, MAkahoshi, FHayashi, Y 1-((S)-gamma-substituted prolyl)-(S)-2-cyanopyrrolidine as a novel series of highly potent DPP-IV inhibitors. Bioorg Med Chem Lett 15:2441-5 (2005)  
Target
Name:
Dipeptidyl peptidase 4
Synonyms:
ADABP Adenosine deaminase complexing protein 2 CD_antigen=CD26 DPP4 DPPIV Dipeptidyl peptidase 4 (DPP IV) Dipeptidyl peptidase 4 (DPP4) Dipeptidyl peptidase 4 membrane form Dipeptidyl peptidase IV Dipeptidyl peptidase IV (DDP-IV) Dipeptidyl peptidase IV membrane form Dipeptidyl peptidase-IV (DPP-4) T-cell activation antigen CD26 | TP103
Type:
Enzyme
Mol. Mass.:
88271.01
Organism:
Homo sapiens (Human)
Description:
P27487
Residue:
766
  
Inhibitor
Name:
BDBM50166310
Synonyms:
(S)-1-((2S,4S)-4-Cyclohexylamino-pyrrolidine-2-carbonyl)-pyrrolidine-2-carbonitrile | CHEMBL192882
Type:
Small organic molecule
Emp. Form.:
C16H26N4O
Mol. Mass.:
290.4038
SMILES:
O=C([C@@H]1C[C@@H](CN1)NC1CCCCC1)N1CCC[C@H]1C#N
: