Target
Dipeptidyl peptidase 4
Ligand
BDBM50166319
Substrate
Meas. Tech.
ChEMBL_305151 (CHEMBL876981)
IC50
0.13±n/a nM
Citation
 Sakashita, HKitajima, HNakamura, MAkahoshi, FHayashi, Y 1-((S)-gamma-substituted prolyl)-(S)-2-cyanopyrrolidine as a novel series of highly potent DPP-IV inhibitors. Bioorg Med Chem Lett 15:2441-5 (2005)  
Target
Name:
Dipeptidyl peptidase 4
Synonyms:
ADABP Adenosine deaminase complexing protein 2 CD_antigen=CD26 DPP4 DPPIV Dipeptidyl peptidase 4 (DPP IV) Dipeptidyl peptidase 4 (DPP4) Dipeptidyl peptidase 4 membrane form Dipeptidyl peptidase IV Dipeptidyl peptidase IV (DDP-IV) Dipeptidyl peptidase IV membrane form Dipeptidyl peptidase-IV (DPP-4) T-cell activation antigen CD26 | TP103
Type:
Enzyme
Mol. Mass.:
88271.01
Organism:
Homo sapiens (Human)
Description:
P27487
Residue:
766
  
Inhibitor
Name:
BDBM50166319
Synonyms:
4-[(3S,5S)-5-((S)-2-Cyano-pyrrolidine-1-carbonyl)-pyrrolidin-3-ylamino]-phthalonitrile | CHEMBL370046
Type:
Small organic molecule
Emp. Form.:
C18H18N6O
Mol. Mass.:
334.3751
SMILES:
O=C([C@@H]1C[C@@H](CN1)Nc1ccc(C#N)c(c1)C#N)N1CCC[C@H]1C#N
: