Target
Dipeptidyl peptidase 4
Ligand
BDBM50166309
Substrate
Meas. Tech.
ChEMBL_305151 (CHEMBL876981)
IC50
0.28±n/a nM
Citation
 Sakashita, HKitajima, HNakamura, MAkahoshi, FHayashi, Y 1-((S)-gamma-substituted prolyl)-(S)-2-cyanopyrrolidine as a novel series of highly potent DPP-IV inhibitors. Bioorg Med Chem Lett 15:2441-5 (2005)  
Target
Name:
Dipeptidyl peptidase 4
Synonyms:
ADABP Adenosine deaminase complexing protein 2 CD_antigen=CD26 DPP4 DPPIV Dipeptidyl peptidase 4 (DPP IV) Dipeptidyl peptidase 4 (DPP4) Dipeptidyl peptidase 4 membrane form Dipeptidyl peptidase IV Dipeptidyl peptidase IV (DDP-IV) Dipeptidyl peptidase IV membrane form Dipeptidyl peptidase-IV (DPP-4) T-cell activation antigen CD26 | TP103
Type:
Enzyme
Mol. Mass.:
88271.01
Organism:
Homo sapiens (Human)
Description:
P27487
Residue:
766
  
Inhibitor
Name:
BDBM50166309
Synonyms:
(S)-1-[(2S,4S)-4-(3,4-Dimethoxy-phenylamino)-pyrrolidine-2-carbonyl]-pyrrolidine-2-carbonitrile | CHEMBL433811
Type:
Small organic molecule
Emp. Form.:
C18H24N4O3
Mol. Mass.:
344.4082
SMILES:
COc1ccc(N[C@@H]2CN[C@@H](C2)C(=O)N2CCC[C@H]2C#N)cc1OC
: