Target
Transporter
Ligand
BDBM50166333
Substrate
Meas. Tech.
ChEMBL_302728 (CHEMBL838676)
Ki
8.8±n/a nM
Citation
 Zhou, JKläss, TJohnson, KMGiberson, KMKozikowski, AP Discovery of novel conformationally constrained tropane-based biaryl and arylacetylene ligands as potent and selective norepinephrine transporter inhibitors and potential antidepressants. Bioorg Med Chem Lett 15:2461-5 (2005)  
Target
Name:
Transporter
Synonyms:
Monoamine transporters; Norepininephrine & dopamine | Norepinephrine Monoamine transporters
Type:
PROTEIN
Mol. Mass.:
66787.87
Organism:
Rattus norvegicus
Description:
ChEMBL_1463061
Residue:
597
  
Inhibitor
Name:
BDBM50166333
Synonyms:
9-[1-(3'-Trifluoromethyl-biphenyl-4-yl)-meth-(Z)-ylidene]-7-aza-tricyclo[4.3.1.0*3,7*]decane-2-carboxylic acid methyl ester | CHEMBL195138
Type:
Small organic molecule
Emp. Form.:
C25H24F3NO2
Mol. Mass.:
427.4588
SMILES:
COC(=O)C1C2CCC3CC1\C(CN23)=C\c1ccc(cc1)-c1cccc(c1)C(F)(F)F
: