Target
Sodium-dependent serotonin transporter
Ligand
BDBM35229
Substrate
Meas. Tech.
ChEMBL_302761 (CHEMBL838825)
Ki
163±n/a nM
Citation
 Zhou, JKläss, TJohnson, KMGiberson, KMKozikowski, AP Discovery of novel conformationally constrained tropane-based biaryl and arylacetylene ligands as potent and selective norepinephrine transporter inhibitors and potential antidepressants. Bioorg Med Chem Lett 15:2461-5 (2005)  
Target
Name:
Sodium-dependent serotonin transporter
Synonyms:
5-HT Transporter 5HT transporter Anandamid membrane transporter, AMT Monoamine transporters; Norepinephrine & serotonin Slc6a4 Sodium-dependent serotonin transporter (SERT) | imipramine receptor
Type:
Multi-pass membrane protein
Mol. Mass.:
70168.43
Organism:
Rattus norvegicus (rat)
Description:
P31652
Residue:
630
  
Inhibitor
Name:
BDBM35229
Synonyms:
3-(10,11-dihydro-5H-dibenzo[b,f]azepin-5-yl)-N-methylpropan-1-amine CHEMBL72 DMI Desipramine N-(3-methylaminopropyl)iminobibenzyl demethylimipramine norimipramine
Type:
Small organic molecule
Emp. Form.:
C18H22N2
Mol. Mass.:
266.3807
SMILES:
CNCCCN1c2ccccc2CCc2ccccc12
: