Target
UDP-N-acetylenolpyruvoylglucosamine reductase
Ligand
BDBM50166491
Substrate
Meas. Tech.
ChEMBL_304867 (CHEMBL829244)
IC50
>50000±n/a nM
Citation
 Kutterer, KMDavis, JMSingh, GYang, YHu, WSeverin, ARasmussen, BAKrishnamurthy, GFailli, AKatz, AH 4-Alkyl and 4,4'-dialkyl 1,2-bis(4-chlorophenyl)pyrazolidine-3,5-dione derivatives as new inhibitors of bacterial cell wall biosynthesis. Bioorg Med Chem Lett 15:2527-31 (2005)  
Target
Name:
UDP-N-acetylenolpyruvoylglucosamine reductase
Synonyms:
MURB_STAAU UDP-N-acetylenolpyruvoylglucosamine reductase | murB
Type:
Protein
Mol. Mass.:
33791.48
Organism:
Staphylococcus aureus (Firmicutes)
Description:
S. aureus MurB
Residue:
307
  
Inhibitor
Name:
BDBM50166491
Synonyms:
1,2-Bis-(4-chloro-phenyl)-4-[2-(2,4-difluoro-phenyl)-2-oxo-ethyl]-4-methyl-pyrazolidine-3,5-dione | CHEMBL362995
Type:
Small organic molecule
Emp. Form.:
C24H16Cl2F2N2O3
Mol. Mass.:
489.298
SMILES:
CC1(CC(=O)c2ccc(F)cc2F)C(=O)N(N(C1=O)c1ccc(Cl)cc1)c1ccc(Cl)cc1
: