Target
Cathepsin K
Ligand
BDBM50167293
Substrate
Meas. Tech.
ChEMBL_303352 (CHEMBL839667)
Ki
>13000±n/a nM
Citation
 Barrett, DGDeaton, DNHassell, AMMcFadyen, RBMiller, ABMiller, LRPayne, JAShewchuk, LMWillard, DHWright, LL Acyclic cyanamide-based inhibitors of cathepsin K. Bioorg Med Chem Lett 15:3039-43 (2005)  
Target
Name:
Cathepsin K
Synonyms:
CATK_HUMAN CTSO Cathepsin O Cathepsin X
Type:
Enzyme
Mol. Mass.:
36975.68
Organism:
Homo sapiens (Human)
Description:
P43235
Residue:
329
  
Inhibitor
Name:
BDBM50167293
Synonyms:
(R)-2-(Cyano-methyl-amino)-propionic acid (S)-2-cyclohexyl-1-methyl-ethyl ester | CHEMBL190864
Type:
Small organic molecule
Emp. Form.:
C14H24N2O2
Mol. Mass.:
252.3526
SMILES:
C[C@@H](CC1CCCCC1)OC(=O)[C@@H](C)N(C)C#N
: