Target
Bifunctional purine biosynthesis protein ATIC
Ligand
BDBM50167702
Substrate
Meas. Tech.
ChEMBL_302287 (CHEMBL830304)
Ki
8000±n/a nM
Citation
 Capps, KJHumiston, JDominique, RHwang, IBoger, DL Discovery of AICAR Tfase inhibitors that disrupt requisite enzyme dimerization. Bioorg Med Chem Lett 15:2840-4 (2005)  
Target
Name:
Bifunctional purine biosynthesis protein ATIC
Synonyms:
5-aminoimidazole-4-carboxamide ribonucleotide formyltransferase AICAR Tfase ATIC Bifunctional purine biosynthesis protein PURH IMP cyclohydrolase Inosinicase PURH Thymidylate synthase/GAR transformylase/AICAR transformylase
Type:
Protein
Mol. Mass.:
64616.62
Organism:
Homo sapiens (Human)
Description:
P31939
Residue:
592
  
Inhibitor
Name:
BDBM50167702
Synonyms:
3-Iodo-N-{[(phenethylcarbamoyl-methyl)-carbamoyl]-methyl}-benzamide | CHEMBL195027
Type:
Small organic molecule
Emp. Form.:
C19H20IN3O3
Mol. Mass.:
465.2849
SMILES:
Ic1cccc(c1)C(=O)NCC(=O)NCC(=O)NCCc1ccccc1
: