Target
Nitric oxide synthase, brain
Ligand
BDBM50138983
Substrate
Meas. Tech.
ChEMBL_305620 (CHEMBL829483)
IC50
60±n/a nM
Citation
 Ijuin, RUmezawa, NNagai, SHiguchi, T Evaluation of 3-substituted arginine analogs as selective inhibitors of human nitric oxide synthase isozymes. Bioorg Med Chem Lett 15:2881-5 (2005)  
Target
Name:
Nitric oxide synthase, brain
Synonyms:
Constitutive NOS NC-NOS NOS type I nNOS NOS1_HUMAN Neuronal nitric oxide synthase Nitric oxide synthase, neuronal (nNOS) bNOS | nNOS
Type:
Homodimer
Mol. Mass.:
160985.98
Organism:
Homo sapiens (Human)
Description:
P29475
Residue:
1434
  
Inhibitor
Name:
BDBM50138983
Synonyms:
(S)-2-Amino-5-(2-methyl-isothioureido)-pentanoic acid 2-Amino-5-(2-methyl-isothioureido)-pentanoic acid N~5~-[(E)-imino(methylsulfanyl)methyl]-L-ornithine SMTC, 5
Type:
Small organic molecule
Emp. Form.:
C7H15N3O2S
Mol. Mass.:
205.278
SMILES:
CSC(N)=NCCC[C@H](N)C(O)=O
: